Target
Integrin alpha-IIb/beta-3
Ligand
BDBM50003330
Substrate
Meas. Tech.
ChEBML_158685
IC50
1110±n/a nM
Citation
 Callahan, JFBean, JWBurgess, JLEggleston, DSHwang, SMKopple, KDKoster, PFNichols, APeishoff, CESamanen, JM Design and synthesis of a C7 mimetic for the predicted gamma-turn conformation found in several constrained RGD antagonists. J Med Chem 35:3970-2 (1992)  
Target
Name:
Integrin alpha-IIb/beta-3
Synonyms:
Glycoprotein IIb/IIIa
Type:
Mol. Mass.:
Description:
ASSAY_ID of EBI is 30109
Components:
This complex has 2 components.
Component 1
Name:
Integrin beta-3
Synonyms:
CD_antigen=CD61 GPIIIa ITGB3 Platelet membrane glycoprotein IIIa
Type:
Protein
Mol. Mass.:
87038.91
Organism:
Homo sapiens (Human)
Description:
P05106
Residue:
788
  
Component 2
Name:
Integrin alpha-IIb
Synonyms:
CD_antigen=CD41 GPIIb Glycoprotein IIb ITGA2B Integrin alpha-IIb heavy chain Integrin alpha-IIb light chain, form 2 Integrin alpha-V/beta-3 and alpha-IIb/beta 3 | Platelet membrane glycoprotein IIb
Type:
Protein
Mol. Mass.:
113354.85
Organism:
Homo sapiens (Human)
Description:
P08514
Residue:
1039
  
Inhibitor
Name:
BDBM50003330
Synonyms:
(5-{[2-(Benzoyl-methyl-amino)-5-guanidino-pentanoylamino]-methyl}-2-oxo-1-phenyl-2,3,6,7-tetrahydro-1H-azepin-3-yl)-acetic acid | CHEMBL423881
Type:
Small organic molecule
Emp. Form.:
C29H36N6O5
Mol. Mass.:
548.6333
SMILES:
CN(C(CCCNC(N)=N)C(=O)NCC1=CC(CC(O)=O)C(=O)N(CC1)c1ccccc1)C(=O)c1ccccc1
: