Target
Polyunsaturated fatty acid 5-lipoxygenase
Ligand
BDBM50003433
Substrate
Meas. Tech.
ChEBML_3958
IC50
>25000±n/a nM
Citation
 Wright, SWHarris, RRKerr, JSGreen, AMPinto, DJBruin, EMCollins, RJDorow, RLMantegna, LRSherk, SR Synthesis, chemical, and biological properties of vinylogous hydroxamic acids: dual inhibitors of 5-lipoxygenase and IL-1 biosynthesis. J Med Chem 35:4061-8 (1992)  
Target
Name:
Polyunsaturated fatty acid 5-lipoxygenase
Synonyms:
Alox5 LOX5_RAT
Type:
PROTEIN
Mol. Mass.:
78082.31
Organism:
Rattus norvegicus
Description:
ChEMBL_1432947
Residue:
673
  
Inhibitor
Name:
BDBM50003433
Synonyms:
3-Benzyloxyamino-1-biphenyl-4-yl-propenone | CHEMBL334528
Type:
Small organic molecule
Emp. Form.:
C22H19NO2
Mol. Mass.:
329.3918
SMILES:
O=C(CC=NOCc1ccccc1)c1ccc(cc1)-c1ccccc1
: