Target
Bifunctional purine biosynthesis protein ATIC
Ligand
BDBM50243508
Substrate
Meas. Tech.
ChEMBL_1672744 (CHEMBL4022773)
IC50
34800±n/a nM
Citation
 Fales, KRNjoroge, FGBrooks, HBThibodeaux, STorrado, ASi, CToth, JLMc Cowan, JRRoth, KDThrasher, KJFrimpong, KLee, MRDally, RDShepherd, TADurham, TBMargolis, BJWu, ZWang, YAtwell, SWang, JHui, YHMeier, TIKonicek, SAGeeganage, S Discovery of N-(6-Fluoro-1-oxo-1,2-dihydroisoquinolin-7-yl)-5-[(3R)-3-hydroxypyrrolidin-1-yl]thiophene-2-sulfonamide (LSN 3213128), a Potent and Selective Nonclassical Antifolate Aminoimidazole-4-carboxamide Ribonucleotide Formyltransferase (AICARFT) Inhibitor Effective at Tumor Suppression in a Can J Med Chem 60:9599-9616 (2017)  
Target
Name:
Bifunctional purine biosynthesis protein ATIC
Synonyms:
5-aminoimidazole-4-carboxamide ribonucleotide formyltransferase AICAR Tfase ATIC Bifunctional purine biosynthesis protein PURH IMP cyclohydrolase Inosinicase PURH Thymidylate synthase/GAR transformylase/AICAR transformylase
Type:
Protein
Mol. Mass.:
64616.62
Organism:
Homo sapiens (Human)
Description:
P31939
Residue:
592
  
Inhibitor
Name:
BDBM50243508
Synonyms:
CHEMBL4101760
Type:
Small organic molecule
Emp. Form.:
C14H9ClN2O4S
Mol. Mass.:
336.75
SMILES:
Clc1ccc(cc1)S(=O)(=O)Nc1ccc2C(=O)NC(=O)c2c1
: