Target
Acidic mammalian chitinase
Ligand
BDBM50243716
Substrate
Meas. Tech.
ChEMBL_1672911 (CHEMBL4022940)
IC50
>100000±n/a nM
Citation
 Mazur, MOlczak, JOlejniczak, SKoralewski, RCzestkowski, WJedrzejczak, AGolab, JDzwonek, KDymek, BSklepkiewicz, PLZagozdzon, ANoonan, TMahboubi, KConway, BSheeler, RBeckett, PHungerford, WMPodjarny, AMitschler, ACousido-Siah, AFadel, FGolebiowski, A Targeting Acidic Mammalian chitinase Is Effective in Animal Model of Asthma. J Med Chem 61:695-710 (2018)  
Target
Name:
Acidic mammalian chitinase
Synonyms:
AMCase Chia YNL
Type:
PROTEIN
Mol. Mass.:
51991.60
Organism:
Mus musculus
Description:
ChEMBL_828636
Residue:
473
  
Inhibitor
Name:
BDBM50243716
Synonyms:
CHEMBL4079129
Type:
Small organic molecule
Emp. Form.:
C16H23BrN6
Mol. Mass.:
379.298
SMILES:
CN(CC1CCN(CC1)c1nc(N)n[nH]1)Cc1ccc(Br)cc1
: