Target
Tyrosine-protein kinase JAK2
Ligand
BDBM50243841
Substrate
Meas. Tech.
ChEMBL_1672941 (CHEMBL4022970)
IC50
437±n/a nM
Citation
 Vazquez, MLKaila, NStrohbach, JWTrzupek, JDBrown, MFFlanagan, MEMitton-Fry, MJJohnson, TATenBrink, REArnold, EPBasak, AHeasley, SEKwon, SLangille, JParikh, MDGriffin, SHCasavant, JMDuclos, BAFenwick, AEHarris, TMHan, SCaspers, NDowty, MEYang, XBanker, MEHegen, MSymanowicz, PTLi, LWang, LLin, THJussif, JClark, JDTelliez, JBRobinson, RPUnwalla, R Identification of N-{cis-3-[Methyl(7H-pyrrolo[2,3-d]pyrimidin-4-yl)amino]cyclobutyl}propane-1-sulfonamide (PF-04965842): A Selective JAK1 Clinical Candidate for the Treatment of Autoimmune Diseases. J Med Chem 61:1130-1152 (2018)  
Target
Name:
Tyrosine-protein kinase JAK2
Synonyms:
JAK-2 JAK2_HUMAN Janus kinase 2 (JAK2) | Janus kinase 2 (a protein tyrosine kinase)
Type:
Protein
Mol. Mass.:
130684.68
Organism:
Homo sapiens (Human)
Description:
O60674
Residue:
1132
  
Inhibitor
Name:
BDBM50243841
Synonyms:
CHEMBL4077614
Type:
Small organic molecule
Emp. Form.:
C16H24N6O2S
Mol. Mass.:
364.466
SMILES:
CN([C@@H]1C[C@@H](C1)NS(=O)(=O)N1CCCCC1)c1ncnc2[nH]ccc12
: