Target
Urokinase-type plasminogen activator
Ligand
BDBM50003740
Substrate
Meas. Tech.
ChEBML_213304
Ki
120±n/a nM
Citation
 Rai, RKatzenellenbogen, JA Effect of conformational mobility and hydrogen-bonding interactions on the selectivity of some guanidinoaryl-substituted mechanism-based inhibitors of trypsin-like serine proteases. J Med Chem 35:4297-305 (1992)  
Target
Name:
Urokinase-type plasminogen activator
Synonyms:
3.4.21.73 U-plasminogen activator Urokinase Urokinase-type plasminogen activator chain B Urokinase-type plasminogen activator short chain A uPA
Type:
Enzyme
Mol. Mass.:
48528.62
Organism:
Homo sapiens (Human)
Description:
P00749
Residue:
431
  
Inhibitor
Name:
BDBM50003740
Synonyms:
(Lactone IIa)N-[4-(2-Methylene-6-oxo-tetrahydro-pyran-4-yl)-phenyl]-guanidine amino{[4-(2-methylene-6-oxotetrahydro-2H-pyran-4-yl)phenyl]amino}methaniminium
Type:
Small organic molecule
Emp. Form.:
C13H15N3O2
Mol. Mass.:
245.2771
SMILES:
[#7]\[#6](-[#7])=[#7]\c1ccc(cc1)-[#6]-1-[#6]-[#6](=[#6])-[#8]-[#6](=O)-[#6]-1
: