Target
Thromboxane-A synthase
Ligand
BDBM50003801
Substrate
Meas. Tech.
ChEBML_209924
IC50
2±n/a nM
Citation
 Bhagwat, SSGude, CBoswell, CContardo, NCohen, DSDotson, RMathis, JLee, WFurness, PZoganas, H Thromboxane receptor antagonism combined with thromboxane synthase inhibition. 4. 8-[[(4-Chlorophenyl)sulfonyl]amino]-4-(3-(3-pyridinyl) propyl)octanoic acid and analogs. J Med Chem 35:4373-83 (1992)  
Target
Name:
Thromboxane-A synthase
Synonyms:
CYP5 Cytochrome P450 5A1 TBXAS1 TXA synthase TXS Thromboxane A2 Synthase (P450 TxA2) Thromboxane prostanoid Thromboxane-A synthase
Type:
Enzyme
Mol. Mass.:
60524.67
Organism:
Homo sapiens (Human)
Description:
P24557
Residue:
533
  
Inhibitor
Name:
BDBM50003801
Synonyms:
4-(3-Pyridin-3-yl-propyl)-8-(4-trifluoromethyl-benzenesulfonylamino)-octanoic acid | CHEMBL139372
Type:
Small organic molecule
Emp. Form.:
C23H29F3N2O4S
Mol. Mass.:
486.548
SMILES:
OC(=O)CCC(CCCCNS(=O)(=O)c1ccc(cc1)C(F)(F)F)CCCc1cccnc1
: