Target
Tyrosine-protein kinase BTK
Ligand
BDBM111952
Substrate
Meas. Tech.
ChEMBL_1673668 (CHEMBL4023697)
Ki
0.690000±n/a nM
Citation
 Crawford, JJJohnson, ARMisner, DLBelmont, LDCastanedo, GChoy, RCoraggio, MDong, LEigenbrot, CErickson, RGhilardi, NHau, JKatewa, AKohli, PBLee, WLubach, JWMcKenzie, BSOrtwine, DFSchutt, LTay, SWei, BReif, KLiu, LWong, HYoung, WB Discovery of GDC-0853: A Potent, Selective, and Noncovalent Bruton's Tyrosine Kinase Inhibitor in Early Clinical Development. J Med Chem 61:2227-2245 (2018)  
Target
Name:
Tyrosine-protein kinase BTK
Synonyms:
AGMX1 Agammaglobulinaemia tyrosine kinase B cell progenitor kinase BPK BTK_HUMAN Tyrosine Kinase BTK Tyrosine-protein kinase BTK (BTK)
Type:
Enzyme
Mol. Mass.:
76289.95
Organism:
Homo sapiens (Human)
Description:
Q06187
Residue:
659
  
Inhibitor
Name:
BDBM111952
Synonyms:
US8618107, 210
Type:
Small organic molecule
Emp. Form.:
C36H40FN7O4
Mol. Mass.:
653.7457
SMILES:
Cn1cc(cc(Nc2ccc(cn2)N2CCN(CC2)C2COC2)c1=O)-c1cc(F)cc(N2CCn3c4CCCCc4cc3C2=O)c1CO
: