Target
Apelin receptor
Ligand
BDBM50244586
Substrate
Meas. Tech.
ChEMBL_1673874 (CHEMBL4023903)
Ki
2.9±n/a nM
Citation
 Trân, KMurza, ASainsily, XCoquerel, DCôté, JBelleville, KHaroune, LLongpré, JMDumaine, RSalvail, DLesur, OAuger-Messier, MSarret, PMarsault, É A Systematic Exploration of Macrocyclization in Apelin-13: Impact on Binding, Signaling, Stability, and Cardiovascular Effects. J Med Chem 61:2266-2277 (2018)  
Target
Name:
Apelin receptor
Synonyms:
AGTRL1 APJ_HUMAN Angiotensin receptor-like 1 Apelin receptor (APJ) G-protein coupled receptor HG11
Type:
Enzyme Catalytic Domain
Mol. Mass.:
42664.06
Organism:
Homo sapiens (Human)
Description:
P35414
Residue:
380
  
Inhibitor
Name:
BDBM50244586
Synonyms:
CHEMBL4083756
Type:
Small organic molecule
Emp. Form.:
C75H116N22O15
Mol. Mass.:
1565.8619
SMILES:
CCCC[C@H](NC(=O)[C@@H]1CCCN1C(=O)CNC(=O)[C@H](CCCCN)NC(=O)[C@H](Cc1cnc[nH]1)NC(=O)[C@H](CC=C)NC(=O)[C@H](CC(C)C)NC(=O)[C@H](CCCNC(N)=N)NC(=O)[C@@H]1CCCN1C(=O)[C@H](CCCNC(N)=N)N(CC=C)C(=O)[C@@H]1CCC(=O)N1)C(=O)N1CCC[C@H]1C(=O)N[C@@H](Cc1ccccc1)C(O)=O
: