Target
Catechol O-methyltransferase
Ligand
BDBM50004047
Substrate
Meas. Tech.
ChEMBL_47058 (CHEMBL661099)
IC50
2100±n/a nM
Citation
 Pérez, RAFernández-Alvarez, ENieto, OPiedrafita, FJ Dihydroxynitrobenzaldehydes and hydroxymethoxynitrobenzaldehydes: synthesis and biological activity as catechol-O-methyltransferase inhibitors. J Med Chem 35:4584-8 (1993)  
Target
Name:
Catechol O-methyltransferase
Synonyms:
COMT | COMT_PIG
Type:
PROTEIN
Mol. Mass.:
20586.58
Organism:
Sus scrofa
Description:
ChEMBL_105412
Residue:
186
  
Inhibitor
Name:
BDBM50004047
Synonyms:
2,3-Dihydroxy-5-nitro-benzaldehyde | CHEMBL141858
Type:
Small organic molecule
Emp. Form.:
C7H5NO5
Mol. Mass.:
183.1183
SMILES:
Oc1cc(cc(C=O)c1O)[N+]([O-])=O
: