Target
Integrin alpha-V/beta-3
Ligand
BDBM50004058
Substrate
Meas. Tech.
ChEBML_81996
IC50
100000±n/a nM
Citation
 Hartman, GDEgbertson, MSHalczenko, WLaswell, WLDuggan, MESmith, RLNaylor, AMManno, PDLynch, RJZhang, G Non-peptide fibrinogen receptor antagonists. 1. Discovery and design of exosite inhibitors. J Med Chem 35:4640-2 (1993)  
Target
Name:
Integrin alpha-V/beta-3
Synonyms:
ITGAV/ITGB3 | Integrin beta-3/Vitronectin receptor alpha
Type:
Enzyme
Mol. Mass.:
Description:
Components:
This complex has 2 components.
Component 1
Name:
Integrin alpha-V
Synonyms:
ITAV_HUMAN Integrin alpha-V/alpha-5 VNRA Vitronectin receptor | Vitronectin receptor subunit alpha
Type:
PROTEIN
Mol. Mass.:
116024.92
Organism:
Homo sapiens (Human)
Description:
ChEMBL_582336
Residue:
1048
  
Component 2
Name:
Integrin beta-3
Synonyms:
CD_antigen=CD61 GPIIIa ITGB3 Platelet membrane glycoprotein IIIa
Type:
Protein
Mol. Mass.:
87038.91
Organism:
Homo sapiens (Human)
Description:
P05106
Residue:
788
  
Inhibitor
Name:
BDBM50004058
Synonyms:
(2S)-2-(butylsulfonylamino)-3-[4-(4-piperidin-4-ylbutoxy)phenyl]propanoic acid N-(butylsulfonyl)-O-(4-piperidin-4-ylbutyl)-L-tyrosine | tirofiban
Type:
Small organic molecule
Emp. Form.:
C22H36N2O5S
Mol. Mass.:
440.597
SMILES:
CCCCS(=O)(=O)N[C@@H](Cc1ccc(OCCCCC2CCNCC2)cc1)C(O)=O
: