Target
Mitogen-activated protein kinase 10
Ligand
BDBM86633
Substrate
Meas. Tech.
ChEMBL_1674682 (CHEMBL4024825)
IC50
1.000000±n/a nM
Citation
 Jackson, PAWiden, JCHarki, DABrummond, KM Covalent Modifiers: A Chemical Perspective on the Reactivity of?,?-Unsaturated Carbonyls with Thiols via Hetero-Michael Addition Reactions. J Med Chem 60:839-885 (2017)  
Target
Name:
Mitogen-activated protein kinase 10
Synonyms:
JNK3 MAP kinase p49 3F12 MK10_HUMAN Mitogen-activated protein kinase 10 (Stress-activated protein kinase JNK3) (c-Jun N-terminal kinase 3) (MAP kinase p49 3F12) PRKM10 Stress-activated protein kinase JNK3 | c-Jun N-terminal kinase 3 (JNK3)
Type:
Enzyme
Mol. Mass.:
52586.89
Organism:
Homo sapiens (Human)
Description:
Residue:
464
  
Inhibitor
Name:
BDBM86633
Synonyms:
JNK-IN-8
Type:
Small organic molecule
Emp. Form.:
C29H29N7O2
Mol. Mass.:
507.5863
SMILES:
CN(C)C\C=C\C(=O)Nc1cccc(c1)C(=O)Nc1ccc(Nc2nccc(n2)-c2cccnc2)c(C)c1
: