Target
Renin
Ligand
BDBM50004410
Substrate
Meas. Tech.
ChEBML_195957
IC50
88±n/a nM
Citation
 Ashton, WTCantone, CLTolman, RLGreenlee, WJLynch, RJSchorn, TWStrouse, JFSiegl, PK Inhibitors of human renin with C-termini derived from amides and esters of alpha-mercaptoalkanoic acids. J Med Chem 35:2772-81 (1992)  
Target
Name:
Renin
Synonyms:
Angiotensinogenase RENI_HUMAN
Type:
Enzyme
Mol. Mass.:
45058.99
Organism:
Homo sapiens (Human)
Description:
Residue:
406
  
Inhibitor
Name:
BDBM50004410
Synonyms:
CHEMBL439774 | {1-[1-{1-Cyclohexylmethyl-2-hydroxy-3-[3-methyl-1-(2-morpholin-4-yl-ethylcarbamoyl)-butane-1-sulfinyl]-propylcarbamoyl}-2-(1H-imidazol-4-yl)-ethylcarbamoyl]-2-phenyl-ethyl}-carbamic acid tert-butyl ester
Type:
Small organic molecule
Emp. Form.:
C42H67N7O8S
Mol. Mass.:
830.088
SMILES:
CC(C)CC(C(=O)NCCN1CCOCC1)S(=O)C[C@H](O)[C@H](CC1CCCCC1)NC(=O)[C@H](Cc1cnc[nH]1)NC(=O)[C@H](Cc1ccccc1)NC(=O)OC(C)(C)C
: