Target
Parathyroid hormone/parathyroid hormone-related peptide receptor
Ligand
BDBM50246388
Substrate
Meas. Tech.
ChEMBL_1676602 (CHEMBL4026745)
EC50
0.270000±n/a nM
Citation
 Cheloha, RWChen, BKumar, NNWatanabe, TThorne, RGLi, LGardella, TJGellman, SH Development of Potent, Protease-Resistant Agonists of the Parathyroid Hormone Receptor with Broad? Residue Distribution. J Med Chem 60:8816-8833 (2017)  
Target
Name:
Parathyroid hormone/parathyroid hormone-related peptide receptor
Synonyms:
PTH/PTHr receptor PTH1 receptor PTH1R_HUMAN PTHR1 Parathyroid hormone receptor
Type:
Enzyme Catalytic Domain
Mol. Mass.:
66370.95
Organism:
Homo sapiens (Human)
Description:
PARATHYROID HT1 0 HUMAN::Q03431
Residue:
593
  
Inhibitor
Name:
BDBM50246388
Synonyms:
CHEMBL4097998
Type:
Small organic molecule
Emp. Form.:
C182H292N56O50S2
Mol. Mass.:
4128.741
SMILES:
CC[C@H](C)[C@H](NC(=O)[C@H](CCC(O)=O)NC(=O)[C@H](CO)NC(=O)[C@H]1CCC[C@@H]1NC(=O)[C@@H](N)CO)C(=O)N[C@@H](CCC(N)=O)C(=O)N[C@@H](CC(C)C)C(=O)N[C@@H](CCSC)C(=O)N[C@@H](Cc1cnc[nH]1)C(=O)N[C@@H](CC(N)=O)C(=O)N[C@@H](CC(C)C)C(=O)NCC(=O)N[C@@H](CCCCN)C(=O)N[C@@H](Cc1cnc[nH]1)C(=O)N[C@@H](CC(C)C)C(=O)N[C@@H](CC(N)=O)C(=O)N[C@@H](CO)C(=O)N[C@@H](CCSC)C(=O)N[C@@H](CCC(O)=O)C(=O)N[C@@H](CCCNC(N)=N)C(=O)N[C@@H](C(C)C)C(=O)N[C@@H](CCC(O)=O)C(=O)N[C@@H](Cc1c[nH]c2ccccc12)C(=O)N[C@@H](CC(C)C)C(=O)N[C@@H](CCCNC(N)=N)C(=O)N[C@@H](CCCCN)C(=O)N[C@@H](CCCCN)C(=O)N[C@@H](CC(C)C)C(=O)N[C@@H](CCC(N)=O)C(=O)N[C@@H](CC(O)=O)C(=O)N[C@@H](C(C)C)C(=O)N[C@@H](Cc1cnc[nH]1)C(=O)N[C@@H](CC(N)=O)C(=O)N[C@@H](Cc1ccccc1)C(N)=O
: