Target
von Hippel-Lindau disease tumor suppressor
Ligand
BDBM50246759
Substrate
Meas. Tech.
ChEMBL_1676792 (CHEMBL4026935)
Kd
500±n/a nM
Citation
 Churcher, I Protac-Induced Protein Degradation in Drug Discovery: Breaking the Rules or Just Making New Ones? J Med Chem 61:444-452 (2018)  
Target
Name:
von Hippel-Lindau disease tumor suppressor
Synonyms:
Protein G7 VHL_HUMAN Von Hippel-Lindau disease tumor suppressor protein (VBC) | pVHL
Type:
Protein
Mol. Mass.:
24136.87
Organism:
Homo sapiens (Human)
Description:
P40337
Residue:
213
  
Inhibitor
Name:
BDBM50246759
Synonyms:
CHEMBL4098772
Type:
Small organic molecule
Emp. Form.:
C52H65N7O11S3
Mol. Mass.:
1060.308
SMILES:
Cc1ncsc1-c1ccc(CNC(=O)[C@@H]2C[C@@H](O)CN2C(=O)[C@@H](NC(=O)COCCOCCOCCOCCOc2cc3nccc(Nc4ccc5scnc5c4)c3cc2S(=O)(=O)C(C)(C)C)C(C)(C)C)cc1
: