Target
Gastrin/cholecystokinin type B receptor
Ligand
BDBM50421963
Substrate
Meas. Tech.
ChEBML_47826
IC50
3.1±n/a nM
Citation
 Holladay, MWBennett, MJTufano, MDLin, CWAsin, KEWitte, DGMiller, TRBianchi, BRNikkel, ALBednarz, L Synthesis and biological activity of CCK heptapeptide analogues. Effects of conformational constraints and standard modifications on receptor subtype selectivity, functional activity in vitro, and appetite suppression in vivo. J Med Chem 35:2919-28 (1992)  
Target
Name:
Gastrin/cholecystokinin type B receptor
Synonyms:
CCK-2 receptor CCK-BR CCKRB Cholecystokinin receptor GASR_HUMAN | Gastrin/cholecystokinin type B receptor
Type:
G Protein-Coupled Receptor (GPCR)
Mol. Mass.:
48445.79
Organism:
Homo sapiens (Human)
Description:
Stable expression of human CCK-2 receptors in HEK 293 cells.
Residue:
447
  
Inhibitor
Name:
BDBM50421963
Synonyms:
CHEMBL2310856
Type:
Small organic molecule
Emp. Form.:
C46H56N8O13S
Mol. Mass.:
961.048
SMILES:
CCCC[C@H](NC(=O)[C@H](Cc1c[nH]c2ccccc12)NC(=O)CNC(=O)[C@@H]1CCCN1C(=O)CCc1ccc(OS(O)(=O)=O)cc1)C(=O)N[C@@H](CC(O)=O)C(=O)N[C@@H](Cc1ccccc1)C(N)=O
: