Target
Phospholipase A2, major isoenzyme
Ligand
BDBM50004495
Substrate
Meas. Tech.
ChEBML_156346
IC50
30±n/a nM
Citation
 Bennion, CConnolly, SGensmantel, NPHallam, CJackson, CGPrimrose, WURoberts, GCRobinson, DHSlaich, PK Design and synthesis of some substrate analogue inhibitors of phospholipase A2 and investigations by NMR and molecular modeling into the binding interactions in the enzyme-inhibitor complex. J Med Chem 35:2939-51 (1992)  
Target
Name:
Phospholipase A2, major isoenzyme
Synonyms:
Group IB phospholipase A2 PLA2G1B Phospholipase A2
Type:
Hydrolase; monomer or homodimer
Mol. Mass.:
16279.83
Organism:
Sus scrofa (pig)
Description:
Purchased from Sigma.
Residue:
146
  
Inhibitor
Name:
BDBM50004495
Synonyms:
CHEMBL101015 | Hexadecanoic acid 3-[hydroxy-(2-hydroxy-ethoxy)-phosphoryloxy]-2-tetradecanoylamino-propyl ester
Type:
Small organic molecule
Emp. Form.:
C35H70NO8P
Mol. Mass.:
663.906
SMILES:
CCCCCCCCCCCCCCCC(=O)OCC(COP(O)(=O)OCCO)NC(=O)CCCCCCCCCCCCC
: