Target
Interleukin-1 receptor-associated kinase 4
Ligand
BDBM50246764
Substrate
Meas. Tech.
ChEMBL_1676839 (CHEMBL4026982)
IC50
4.0±n/a nM
Citation
 Scott, JSDegorce, SLAnjum, RCulshaw, JDavies, RDMDavies, NLDillman, KSDowling, JEDrew, LFerguson, ADGroombridge, SDHalsall, CTHudson, JALamont, SLindsay, NAMarden, SKMayo, MFPease, JEPerkins, DRPink, JHRobb, GRRosen, AShen, MMcWhirter, CWu, D Discovery and Optimization of Pyrrolopyrimidine Inhibitors of Interleukin-1 Receptor Associated Kinase 4 (IRAK4) for the Treatment of Mutant MYD88 J Med Chem 60:10071-10091 (2017)  
Target
Name:
Interleukin-1 receptor-associated kinase 4
Synonyms:
IRAK-4 IRAK4_HUMAN Interleukin-1 receptor-associated kinase 4 (IRAK4) | Renal carcinoma antigen NY-REN-64
Type:
Protein
Mol. Mass.:
51519.08
Organism:
Homo sapiens (Human)
Description:
Q9NWZ3
Residue:
460
  
Inhibitor
Name:
BDBM50246764
Synonyms:
CHEMBL4087063
Type:
Small organic molecule
Emp. Form.:
C21H30N4O2S
Mol. Mass.:
402.554
SMILES:
C1CC(CCO1)c1c[nH]c2ncnc(S[C@H]3CC[C@@H](CC3)N3CCOCC3)c12
: