Target
Acetyl-CoA carboxylase 1
Ligand
BDBM50247080
Substrate
Meas. Tech.
ChEMBL_1677380 (CHEMBL4027523)
IC50
5.3±n/a nM
Citation
 Mizojiri, RAsano, MTomita, DBanno, HNii, NSasaki, MSumi, HSatoh, YYamamoto, YMoriya, TSatomi, YMaezaki, H Discovery of Novel Selective Acetyl-CoA Carboxylase (ACC) 1 Inhibitors. J Med Chem 61:1098-1117 (2018)  
Target
Name:
Acetyl-CoA carboxylase 1
Synonyms:
ACAC ACACA_HUMAN ACC1 Acetyl-CoA carboxylase 1 | Acetyl-CoA carboxylase 1 (ACC1)
Type:
Protein
Mol. Mass.:
265543.22
Organism:
Homo sapiens (Human)
Description:
Q13085
Residue:
2346
  
Inhibitor
Name:
BDBM50247080
Synonyms:
CHEMBL4098647
Type:
Small organic molecule
Emp. Form.:
C27H26N2O4
Mol. Mass.:
442.5063
SMILES:
CC(NC(C)=O)c1ccc2nc(oc2c1)-c1ccc(Oc2cccc(OCC3CC3)c2)cc1
: