Target
Muscarinic acetylcholine receptor M2
Ligand
BDBM50004664
Substrate
Meas. Tech.
ChEMBL_139897 (CHEMBL744484)
Ki
460±n/a nM
Citation
 Valli, MJTang, YKosh, JWChapman, JMSowell, JW Synthesis and cholinergic properties of N-aryl-2-[[[5-[(dimethylamino)methyl]-2-furanyl]methyl]thio]ethylamino analogs of ranitidine. J Med Chem 35:3141-7 (1992)  
Target
Name:
Muscarinic acetylcholine receptor M2
Synonyms:
ACM2_MOUSE Chrm2 | Muscarinic acetylcholine receptor
Type:
PROTEIN
Mol. Mass.:
51515.43
Organism:
Mus musculus
Description:
ChEMBL_139897
Residue:
466
  
Inhibitor
Name:
BDBM50004664
Synonyms:
CHEMBL107892 | N-[2-(5-Dimethylaminomethyl-furan-2-ylmethylsulfanyl)-ethyl]-4,6-dinitro-benzene-1,3-diamine
Type:
Small organic molecule
Emp. Form.:
C16H21N5O5S
Mol. Mass.:
395.433
SMILES:
CN(C)Cc1ccc(CSCCNc2cc(N)c(cc2[N+]([O-])=O)[N+]([O-])=O)o1
: