Target
cGMP-dependent 3',5'-cyclic phosphodiesterase
Ligand
BDBM107767
Substrate
Meas. Tech.
ChEMBL_1677872 (CHEMBL4028015)
IC50
1.6±n/a nM
Citation
 Helal, CJArnold, EBoyden, TChang, CChappie, TAFisher, EHajos, MHarms, JFHoffman, WEHumphrey, JMPandit, JKang, ZKleiman, RJKormos, BLLee, CWLu, JMaklad, NMcDowell, LMcGinnis, DO'Connor, REO'Donnell, CJOgden, APiotrowski, MSchmidt, CJSeymour, PAUeno, HVansell, NVerhoest, PRYang, EX Identification of a Potent, Highly Selective, and Brain Penetrant Phosphodiesterase 2A Inhibitor Clinical Candidate. J Med Chem 61:1001-1018 (2018)  
Target
Name:
cGMP-dependent 3',5'-cyclic phosphodiesterase
Synonyms:
CGS-PDE Homo sapiens phosphodiesterase 2A (PDE2A) PDE2A cGSPDE
Type:
Enzyme Catalytic Domain
Mol. Mass.:
105691.58
Organism:
Homo sapiens (Human)
Description:
O00408
Residue:
941
  
Inhibitor
Name:
BDBM107767
Synonyms:
US11419874, PF-05180999 | US8598155, 2
Type:
Small organic molecule
Emp. Form.:
C19H17F3N8
Mol. Mass.:
414.3871
SMILES:
Cc1nc(-c2cnn(C)c2-c2ccc(cn2)C(F)(F)F)c2c(ncnn12)N1CCC1
: