Target
Metallo-beta-lactamase VIM-2
Ligand
BDBM50247639
Substrate
Meas. Tech.
ChEMBL_1678300 (CHEMBL4028443)
IC50
498±n/a nM
Citation
 Gilberg, EGütschow, MBajorath, J X-ray Structures of Target-Ligand Complexes Containing Compounds with Assay Interference Potential. J Med Chem 61:1276-1284 (2018)  
Target
Name:
Metallo-beta-lactamase VIM-2
Synonyms:
Beta-lactamase VIM-2 | Metallo-beta-lactamase VIM-2 (VIM-2)
Type:
Protein
Mol. Mass.:
28318.00
Organism:
Pseudomonas aeruginosa (g-Proteobacteria)
Description:
Residue:
266
  
Inhibitor
Name:
BDBM50247639
Synonyms:
CHEMBL4068716
Type:
Small organic molecule
Emp. Form.:
C17H17Cl3N4O2S2
Mol. Mass.:
479.831
SMILES:
CN1CCN(CC1)NC(=O)CN1C(=S)S\C(=C/c2c(Cl)ccc(Cl)c2Cl)C1=O
: