Target
ATP-binding cassette sub-family C member 2
Ligand
BDBM10847
Substrate
Meas. Tech.
ChEMBL_1678645 (CHEMBL4028922)
IC50
>133000±n/a nM
Citation
 Morgan, REvan Staden, CJChen, YKalyanaraman, NKalanzi, JDunn, RTAfshari, CAHamadeh, HK A multifactorial approach to hepatobiliary transporter assessment enables improved therapeutic compound development. Toxicol Sci 136:216-41 (2013)  
Target
Name:
ATP-binding cassette sub-family C member 2
Synonyms:
ABCC2 CMOAT CMRP Canalicular multispecific organic anion transporter 1 MRP2 Multidrug resistance-associated protein 2 Multidrug resistance-associated protein 3 (MRP3)
Type:
Protein
Mol. Mass.:
174229.45
Organism:
Homo sapiens (Human)
Description:
Q92887
Residue:
1545
  
Inhibitor
Name:
BDBM10847
Synonyms:
1,3-dimethyl-2,3,6,7-tetrahydro-1H-purine-2,6-dione Afonilum Aminophylline Cardophyllin Theophy-lline Theophylline (1,3-dimethylxanthine)
Type:
Small organic molecule
Emp. Form.:
C7H8N4O2
Mol. Mass.:
180.164
SMILES:
Cn1c2nc[nH]c2c(=O)n(C)c1=O
: