Target
Bile salt export pump
Ligand
BDBM50017662
Substrate
Meas. Tech.
ChEMBL_1678644 (CHEMBL4028921)
IC50
>133000±n/a nM
Citation
 Morgan, REvan Staden, CJChen, YKalyanaraman, NKalanzi, JDunn, RTAfshari, CAHamadeh, HK A multifactorial approach to hepatobiliary transporter assessment enables improved therapeutic compound development. Toxicol Sci 136:216-41 (2013)  
Target
Name:
Bile salt export pump
Synonyms:
ABCB11 ATP-binding cassette sub-family B member 11 Bile Salt Export Pump, BSEP Bile salt export pump (BSEP)
Type:
Protein
Mol. Mass.:
146405.49
Organism:
Homo sapiens (Human)
Description:
O95342
Residue:
1321
  
Inhibitor
Name:
BDBM50017662
Synonyms:
2-(Diethylamino)-2',6'-acetoxylidide CHEMBL79 LIDOCAINE N-(2,6-dimethylphenyl)-N(2),N(2)-diethylglycinamide SAMPL3, G5
Type:
Small organic molecule
Emp. Form.:
C14H22N2O
Mol. Mass.:
234.3373
SMILES:
CCN(CC)CC(=O)Nc1c(C)cccc1C
: