Target
ATP-binding cassette sub-family C member 3
Ligand
BDBM25817
Substrate
Meas. Tech.
ChEMBL_1678646 (CHEMBL4028923)
IC50
>133000±n/a nM
Citation
 Morgan, REvan Staden, CJChen, YKalyanaraman, NKalanzi, JDunn, RTAfshari, CAHamadeh, HK A multifactorial approach to hepatobiliary transporter assessment enables improved therapeutic compound development. Toxicol Sci 136:216-41 (2013)  
Target
Name:
ATP-binding cassette sub-family C member 3
Synonyms:
ABCC3 CMOAT2 MLP2 MRP3 Multi-specific organic anion transporter D | Multidrug resistance-associated protein 3
Type:
PROTEIN
Mol. Mass.:
169352.45
Organism:
Homo sapiens (Human)
Description:
ChEMBL_735421
Residue:
1527
  
Inhibitor
Name:
BDBM25817
Synonyms:
2-(2,4-difluorophenyl)-1,3-bis(1H-1,2,4-triazol-1-yl)propan-2-ol Diflucan Fluconazole (f) Triflucan US11247981, Example Fluconazole US9144538, Fluconazole US9556143, Fluconazole | cid_3365
Type:
Small organic molecule
Emp. Form.:
C13H12F2N6O
Mol. Mass.:
306.2708
SMILES:
OC(Cn1cncn1)(Cn1cncn1)c1ccc(F)cc1F
: