Target
ATP-binding cassette sub-family C member 4
Ligand
BDBM50108877
Substrate
Meas. Tech.
ChEMBL_1678647 (CHEMBL4028924)
IC50
16700±n/a nM
Citation
 Morgan, REvan Staden, CJChen, YKalyanaraman, NKalanzi, JDunn, RTAfshari, CAHamadeh, HK A multifactorial approach to hepatobiliary transporter assessment enables improved therapeutic compound development. Toxicol Sci 136:216-41 (2013)  
Target
Name:
ATP-binding cassette sub-family C member 4
Synonyms:
ABCC4 MOAT-B MRP/cMOAT-related ABC transporter MRP4_HUMAN Multidrug resistance-associated protein 4
Type:
PROTEIN
Mol. Mass.:
149546.12
Organism:
Homo sapiens (Human)
Description:
ChEMBL_1486828
Residue:
1325
  
Inhibitor
Name:
BDBM50108877
Synonyms:
(3,4-Dihydroxy-5-nitro-phenyl)-p-tolyl-methanone CHEMBL1324 TOLCAPONE Tasmar
Type:
Small organic molecule
Emp. Form.:
C14H11NO5
Mol. Mass.:
273.2408
SMILES:
Cc1ccc(cc1)C(=O)c1cc(O)c(O)c(c1)[N+]([O-])=O
: