Target
ATP-binding cassette sub-family C member 4
Ligand
BDBM50017662
Substrate
Meas. Tech.
ChEMBL_1678647 (CHEMBL4028924)
IC50
>133000±n/a nM
Citation
 Morgan, REvan Staden, CJChen, YKalyanaraman, NKalanzi, JDunn, RTAfshari, CAHamadeh, HK A multifactorial approach to hepatobiliary transporter assessment enables improved therapeutic compound development. Toxicol Sci 136:216-41 (2013)  
Target
Name:
ATP-binding cassette sub-family C member 4
Synonyms:
ABCC4 MOAT-B MRP/cMOAT-related ABC transporter MRP4_HUMAN Multidrug resistance-associated protein 4
Type:
PROTEIN
Mol. Mass.:
149546.12
Organism:
Homo sapiens (Human)
Description:
ChEMBL_1486828
Residue:
1325
  
Inhibitor
Name:
BDBM50017662
Synonyms:
2-(Diethylamino)-2',6'-acetoxylidide CHEMBL79 LIDOCAINE N-(2,6-dimethylphenyl)-N(2),N(2)-diethylglycinamide SAMPL3, G5
Type:
Small organic molecule
Emp. Form.:
C14H22N2O
Mol. Mass.:
234.3373
SMILES:
CCN(CC)CC(=O)Nc1c(C)cccc1C
: