Target
Glutamate receptor ionotropic, NMDA 1
Ligand
BDBM50005066
Substrate
Meas. Tech.
ChEBML_141849
IC50
52.0±n/a nM
Citation
 Leeson, PDCarling, RWMoore, KWMoseley, AMSmith, JDStevenson, GChan, TBaker, RFoster, ACGrimwood, S 4-Amido-2-carboxytetrahydroquinolines. Structure-activity relationships for antagonism at the glycine site of the NMDA receptor. J Med Chem 35:1954-68 (1992)  
Target
Name:
Glutamate receptor ionotropic, NMDA 1
Synonyms:
Glutamate (NMDA) receptor subunit zeta 1 Glutamate-NMDA-Channel Glutamate-NMDA-Polyamine NMDA Nmdar1 | phencyclidine
Type:
Enzyme Catalytic Domain
Mol. Mass.:
105533.40
Organism:
RAT
Description:
P35439
Residue:
938
  
Inhibitor
Name:
BDBM50005066
Synonyms:
5,7-Dichloro-4-[2-(4-chloro-phenyl)-acetylamino]-1,2,3,4-tetrahydro-quinoline-2-carboxylic acid | CHEMBL291877
Type:
Small organic molecule
Emp. Form.:
C18H15Cl3N2O3
Mol. Mass.:
413.682
SMILES:
OC(=O)[C@H]1C[C@H](NC(=O)Cc2ccc(Cl)cc2)c2c(Cl)cc(Cl)cc2N1
: