Target
Cyclin-C
Ligand
BDBM50248635
Substrate
Meas. Tech.
ChEMBL_1679274 (CHEMBL4029551)
IC50
0.470000±n/a nM
Citation
 Ono, KBanno, HOkaniwa, MHirayama, TIwamura, NHikichi, YMurai, SHasegawa, MHasegawa, YYonemori, KHata, AAoyama, KCary, DR Design and synthesis of selective CDK8/19 dual inhibitors: Discovery of 4,5-dihydrothieno[3',4':3,4]benzo[1,2-d]isothiazole derivatives. Bioorg Med Chem 25:2336-2350 (2017)  
Target
Name:
Cyclin-C
Synonyms:
CCNC Cyclin C hSRB11
Type:
PROTEIN
Mol. Mass.:
33244.88
Organism:
Homo sapiens (Human)
Description:
ChEMBL_107900
Residue:
283
  
Inhibitor
Name:
BDBM50248635
Synonyms:
CHEMBL4070408
Type:
Small organic molecule
Emp. Form.:
C16H13N3O2S2
Mol. Mass.:
343.423
SMILES:
Cc1ncccc1Oc1sc(C(N)=O)c2CCc3cnsc3-c12
: