Target
Platelet-activating factor receptor
Ligand
BDBM50005222
Substrate
Meas. Tech.
ChEBML_164926
IC50
25±n/a nM
Citation
 Carceller, EMerlos, MGiral, MBartrolí, JGarcía-Rafanell, JForn, J 4-substituted 2-alkoxytetrahydrofurans as potent and long-lasting PAF antagonists. J Med Chem 35:676-83 (1992)  
Target
Name:
Platelet-activating factor receptor
Synonyms:
PAF-R PTAFR_CAVPO Platelet-activating factor receptor
Type:
Protein
Mol. Mass.:
39005.63
Organism:
Cavia porcellus
Description:
Residue:
342
  
Inhibitor
Name:
BDBM50005222
Synonyms:
2-({Acetyl-[5-(6-oct-7-enyloxy-hexyloxy)-tetrahydro-furan-3-ylmethoxycarbonyl]-amino}-methyl)-1-ethyl-pyridinium; iodide | CHEMBL161127
Type:
Small organic molecule
Emp. Form.:
C30H49N2O6
Mol. Mass.:
533.7193
SMILES:
CC[n+]1ccccc1CN(C(C)=O)C(=O)OCC1COC(C1)OCCCCCCOCCCCCCC=C
: