Target
Muscarinic acetylcholine receptor M2
Ligand
BDBM50005363
Substrate
Meas. Tech.
ChEMBL_139982 (CHEMBL751168)
EC50
19.0±n/a nM
Citation
 Showell, GABaker, RDavis, JHargreaves, RFreedman, SBHoogsteen, KPatel, SSnow, RJ Synthesis and in vitro biological profile of all four isomers of the potent muscarinic agonist 3-(3-methyl-1,2,4-oxadiazol-5-yl)-1-azabicyclo[2.2.1]heptane. J Med Chem 35:911-6 (1992)  
Target
Name:
Muscarinic acetylcholine receptor M2
Synonyms:
ACM2_HUMAN Cholinergic, muscarinic M2 Muscarinic acetylcholine receptor M2 and M5 | RecName: Full=Muscarinic acetylcholine receptor M2
Type:
GPCR
Mol. Mass.:
51730.61
Organism:
Homo sapiens (Human)
Description:
P08172
Residue:
466
  
Inhibitor
Name:
BDBM50005363
Synonyms:
(3R,4R)3-(3-Methyl-[1,2,4]oxadiazol-5-yl)-1-aza-bicyclo[2.2.1]heptane (3S,4S)3-(3-Methyl-[1,2,4]oxadiazol-5-yl)-1-aza-bicyclo[2.2.1]heptane CHEMBL92421
Type:
Small organic molecule
Emp. Form.:
C9H13N3O
Mol. Mass.:
179.219
SMILES:
Cc1noc(n1)C1CN2CCC1C2
: