Target
Advanced glycosylation end product-specific receptor
Ligand
BDBM50249567
Substrate
Meas. Tech.
ChEMBL_1680058 (CHEMBL4030335)
Ki
230±n/a nM
Citation
 Bongarzone, SSavickas, VLuzi, FGee, AD Targeting the Receptor for Advanced Glycation Endproducts (RAGE): A Medicinal Chemistry Perspective. J Med Chem 60:7213-7232 (2017)  
Target
Name:
Advanced glycosylation end product-specific receptor
Synonyms:
AGER RAGE_HUMAN | Receptor for advanced glycosylation end products
Type:
PROTEIN
Mol. Mass.:
42800.11
Organism:
Homo sapiens (Human)
Description:
ChEMBL_1339877
Residue:
404
  
Inhibitor
Name:
BDBM50249567
Synonyms:
CHEMBL4075936
Type:
Small organic molecule
Emp. Form.:
C20H22ClNO
Mol. Mass.:
327.848
SMILES:
Clc1ccc(cc1)C(=O)N(Cc1ccccc1)C1CCCCC1
: