Target
Toll-like receptor 7
Ligand
BDBM50249709
Substrate
Meas. Tech.
ChEBML_1680432
EC50
260±n/a nM
Citation
 McGowan, DCHerschke, FPauwels, FStoops, BSmyej, ILast, SPieters, SEmbrechts, WKhamlichi, MDThoné, TVan Schoubroeck, BMostmans, WWuyts, DVerstappen, DScholliers, ADe Pooter, DDhuyvetter, DBorghys, HTuefferd, MArnoult, EHong, JFanning, GBollekens, JUrmaliya, VTeisman, AHorton, HJonckers, THMRaboisson, P Identification and Optimization of Pyrrolo[3,2-d]pyrimidine Toll-like Receptor 7 (TLR7) Selective Agonists for the Treatment of Hepatitis B. J Med Chem 60:6137-6151 (2017)  
Target
Name:
Toll-like receptor 7
Synonyms:
ORF Names:UNQ248/PRO285 TLR7_HUMAN | Toll-like receptor 7 (TLR7)
Type:
Enzyme
Mol. Mass.:
120945.35
Organism:
Homo sapiens (Human)
Description:
Q9NYK1
Residue:
1049
  
Inhibitor
Name:
BDBM50249709
Synonyms:
CHEMBL4075398
Type:
Small organic molecule
Emp. Form.:
C16H20N6
Mol. Mass.:
296.3702
SMILES:
CCCCNc1nc(N)nc2ccn(Cc3cccnc3)c12
: