Target
Aldo-keto reductase family 1 member B1
Ligand
BDBM50005525
Substrate
Meas. Tech.
ChEMBL_31923 (CHEMBL642966)
IC50
550±n/a nM
Citation
 Smar, MWAres, JJNakayama, TItabe, HKador, PFMiller, DD Selective irreversible inhibitors of aldose reductase. J Med Chem 35:1117-20 (1992)  
Target
Name:
Aldo-keto reductase family 1 member B1
Synonyms:
ALDR_RAT Akr1b4 Aldr1
Type:
PROTEIN
Mol. Mass.:
35797.87
Organism:
Rattus norvegicus
Description:
ChEMBL_1512484
Residue:
316
  
Inhibitor
Name:
BDBM50005525
Synonyms:
CHEMBL13997 | [5-(2-Chloro-acetyl)-1,3-dioxo-1H,3H-benzo[de]isoquinolin-2-yl]-acetic acid
Type:
Small organic molecule
Emp. Form.:
C16H10ClNO5
Mol. Mass.:
331.707
SMILES:
OC(=O)CN1C(=O)c2cccc3cc(cc(C1=O)c23)C(=O)CCl
: