Target
Homeobox protein Nkx-2.5/Transcription factor GATA-4
Ligand
BDBM50249971
Substrate
Meas. Tech.
ChEMBL_1680721 (CHEMBL4030998)
IC50
>50000±n/a nM
Citation
 Välimäki, MJTölli, MAKinnunen, SMAro, JSerpi, RPohjolainen, LTalman, VPoso, ARuskoaho, HJ Discovery of Small Molecules Targeting the Synergy of Cardiac Transcription Factors GATA4 and NKX2-5. J Med Chem 60:7781-7798 (2017)  
Target
Name:
Homeobox protein Nkx-2.5/Transcription factor GATA-4
Synonyms:
GATA4/NKX2-5
Type:
Mol. Mass.:
Description:
ASSAY_ID of ChEMBL is 1680721
Components:
This complex has 2 components.
Component 1
Name:
Transcription factor GATA-4
Synonyms:
GATA-binding factor 4 Gata-4 Transcription factor GATA-4
Type:
PROTEIN
Mol. Mass.:
44598.13
Organism:
Mus musculus
Description:
ChEMBL_117707
Residue:
441
  
Component 2
Name:
Homeobox protein Nkx-2.5
Synonyms:
Cardiac-specific homeobox Homeobox protein CSX Homeobox protein Nkx-2.5 Nkx-2.5 Nkx2e
Type:
PROTEIN
Mol. Mass.:
34174.01
Organism:
Mus musculus
Description:
ChEMBL_117707
Residue:
318
  
Inhibitor
Name:
BDBM50249971
Synonyms:
CHEMBL4091690
Type:
Small organic molecule
Emp. Form.:
C23H18N2O3
Mol. Mass.:
370.4006
SMILES:
Cc1onc(c1C(=O)Nc1ccc(Oc2ccccc2)cc1)-c1ccccc1
: