Target
Glucocorticoid receptor
Ligand
BDBM141367
Substrate
Meas. Tech.
ChEMBL_1680909 (CHEMBL4031186)
IC50
1.4±n/a nM
Citation
 Hemmerling, MNilsson, SEdman, KEirefelt, SRussell, WHendrickx, RJohnsson, EKärrman Mårdh, CBerger, MRehwinkel, HAbrahamsson, ADahmén, JEriksson, ARGabos, BHenriksson, KHossain, NIvanova, SJansson, AHJensen, TJJerre, AJohansson, HKlingstedt, TLepistö, MLindsjö, MMile, INikitidis, GSteele, JTehler, UWissler, LHansson, T Selective Nonsteroidal Glucocorticoid Receptor Modulators for the Inhaled Treatment of Pulmonary Diseases. J Med Chem 60:8591-8605 (2017)  
Target
Name:
Glucocorticoid receptor
Synonyms:
GCR_HUMAN GRL Glucocorticoid receptor (GRFP) Nuclear receptor subfamily 3 group C member 1
Type:
Enzyme
Mol. Mass.:
85656.87
Organism:
Homo sapiens (Human)
Description:
P04150
Residue:
777
  
Inhibitor
Name:
BDBM141367
Synonyms:
US8916600, 1 US9738632, Example 1
Type:
Small organic molecule
Emp. Form.:
C32H32F2N4O7S
Mol. Mass.:
654.681
SMILES:
C[C@H](NC(=O)C(C)(F)F)[C@H](Oc1ccc2n(ncc2c1)-c1cccc(c1)C(=O)N[C@H]1CCS(=O)(=O)C1)c1ccc2OCCOc2c1
: