Target
Acid-sensing ion channel 1
Ligand
BDBM50009859
Substrate
Meas. Tech.
ChEMBL_1680967 (CHEMBL4031244)
IC50
513000±n/a nM
Citation
 Lynagh, TRomero-Rojo, JLLund, CPless, SA Molecular Basis for Allosteric Inhibition of Acid-Sensing Ion Channel 1a by Ibuprofen. J Med Chem 60:8192-8200 (2017)  
Target
Name:
Acid-sensing ion channel 1
Synonyms:
ASIC1_RAT Acid-sensing ion channel 1 Asic1 Brain sodium channel 2
Type:
PROTEIN
Mol. Mass.:
59630.33
Organism:
Rattus norvegicus
Description:
ChEMBL_109766
Residue:
526
  
Inhibitor
Name:
BDBM50009859
Synonyms:
(+-)-2-(p-isobutylphenyl)propionic acid (+-)-ibuprofen (4-isobutylphenyl)-alpha-methylacetic acid 2-(4-isobutylphenyl)propanoic acid 4-isobutylhydratropic acid Brufen IBUPROFEN LYSINE Ibuprofen (1) alpha-(4-isobutylphenyl)propionic acid | alpha-(p-isobutylphenyl)propionic acid
Type:
Small organic molecule
Emp. Form.:
C13H18O2
Mol. Mass.:
206.2808
SMILES:
CC(C)Cc1ccc(cc1)C(C)C(O)=O
: