Target
Stromelysin-2
Ligand
BDBM50250162
Substrate
Meas. Tech.
ChEMBL_1681097 (CHEMBL4031374)
IC50
141±n/a nM
Citation
 Senn, NOtt, MLanz, JRiedl, R Targeted Polypharmacology: Discovery of a Highly Potent Non-Hydroxamate Dual Matrix Metalloproteinase (MMP)-10/-13 Inhibitor. J Med Chem 60:9585-9598 (2017)  
Target
Name:
Stromelysin-2
Synonyms:
MMP10 Matrix Metalloproteinase-10 (MMP-10) STMY2
Type:
Enzyme
Mol. Mass.:
54143.02
Organism:
Homo sapiens (Human)
Description:
P09238
Residue:
476
  
Inhibitor
Name:
BDBM50250162
Synonyms:
CHEMBL4098213
Type:
Small organic molecule
Emp. Form.:
C26H27FN4O6S
Mol. Mass.:
542.579
SMILES:
COc1cc(CNC(=O)C#Cc2cn(Cc3ccc(cc3)S(=O)(=O)NC(C)(C)C)c(=O)[nH]c2=O)ccc1F
: