Target
Muscarinic acetylcholine receptor M3
Ligand
BDBM50005685
Substrate
Meas. Tech.
ChEBML_138700
Ki
7.7±n/a nM
Citation
 Leader, HGordon, RKBaumgold, JBoyd, VLNewman, AHSmejkal, RMChiang, PK Muscarinic receptor subtype specificity of (N,N-dialkylamino)alkyl 2-cyclohexyl-2-phenylpropionates: cylexphenes (cyclohexyl-substituted aprophen analogues). J Med Chem 35:1290-5 (1992)  
Target
Name:
Muscarinic acetylcholine receptor M3
Synonyms:
ACM3_HUMAN Cholinergic, muscarinic M3 Muscarinic receptor M3 | RecName: Full=Muscarinic acetylcholine receptor M3
Type:
Enzyme
Mol. Mass.:
66151.03
Organism:
Homo sapiens (Human)
Description:
P20309
Residue:
590
  
Inhibitor
Name:
BDBM50005685
Synonyms:
2,2-Diphenyl-propionic acid 2-diethylamino-ethyl ester 2-(diethylamino)ethyl 2,2-diphenylpropanoate Aprophen | CHEMBL26505
Type:
Small organic molecule
Emp. Form.:
C21H27NO2
Mol. Mass.:
325.4446
SMILES:
CCN(CC)CCOC(=O)C(C)(c1ccccc1)c1ccccc1
: