Target
Ornithine decarboxylase
Ligand
BDBM50005713
Substrate
Meas. Tech.
ChEBML_148124
IC50
1100±n/a nM
Citation
 Stanek, JFrei, JMett, HSchneider, PRegenass, U 2-substituted 3-(aminooxy)propanamines as inhibitors of ornithine decarboxylase: synthesis and biological activity. J Med Chem 35:1339-44 (1992)  
Target
Name:
Ornithine decarboxylase
Synonyms:
DCOR_RAT Odc1
Type:
PROTEIN
Mol. Mass.:
51037.04
Organism:
Rattus norvegicus
Description:
ChEMBL_1344641
Residue:
461
  
Inhibitor
Name:
BDBM50005713
Synonyms:
CHEMBL282411 | Methanesulfonic acid 1-aminomethyl-2-aminooxy-ethyl ester
Type:
Small organic molecule
Emp. Form.:
C4H12N2O4S
Mol. Mass.:
184.214
SMILES:
CS(=O)(=O)OC(CN)CON
: