Target
Trifunctional purine biosynthetic protein adenosine-3
Ligand
BDBM50005739
Substrate
Meas. Tech.
ChEBML_69927
IC50
52000±n/a nM
Citation
 Bigham, ECHodson, SJMallory, WRWilson, DDuch, DSSmith, GKFerone, R Synthesis and biological activity of open-chain analogues of 5,6,7,8-tetrahydrofolic acid--potential antitumor agents. J Med Chem 35:1399-410 (1992)  
Target
Name:
Trifunctional purine biosynthetic protein adenosine-3
Synonyms:
GAR Tfase GART Glycinamide ribonucleotide transformylase (GAR Tfase) PRGS Thymidylate synthase/GAR transformylase/AICAR transformylase
Type:
Protein
Mol. Mass.:
107768.47
Organism:
Homo sapiens (Human)
Description:
P22102
Residue:
1010
  
Inhibitor
Name:
BDBM50005739
Synonyms:
2-{4-[3-(4-Amino-6-oxo-1,6-dihydro-pyrimidin-5-yl)-propylamino]-benzoylamino}-pentanedioic acid | CHEMBL31027
Type:
Small organic molecule
Emp. Form.:
C19H23N5O6
Mol. Mass.:
417.4158
SMILES:
Nc1nc[nH]c(=O)c1CCCNc1ccc(cc1)C(=O)NC(CCC(O)=O)C(O)=O
: