Target
Melanocortin receptor 5
Ligand
BDBM50268806
Substrate
Meas. Tech.
ChEMBL_1681910 (CHEMBL4032187)
IC50
2.4±n/a nM
Citation
 Zhou, YMowlazadeh Haghighi, SZoi, ISawyer, JRHruby, VJCai, M Design of MC1R Selective?-MSH Analogues with Canonical Amino Acids Leads to Potency and Pigmentation. J Med Chem 60:9320-9329 (2017)  
Target
Name:
Melanocortin receptor 5
Synonyms:
MC-2 MC5R Melanocortin MC5 Melanocortin receptor 5 | Melanocortin receptor 5 (MC5R)
Type:
Enzyme
Mol. Mass.:
36612.92
Organism:
Homo sapiens (Human)
Description:
P33032
Residue:
325
  
Inhibitor
Name:
BDBM50268806
Synonyms:
Ac-Tyr-Val-Nle-Gly-His-DPhe-Arg-Trp-Asp-Arg-Phe-Gly-NH2) | CHEMBL503229
Type:
Small organic molecule
Emp. Form.:
C77H104N22O16
Mol. Mass.:
1593.7875
SMILES:
CCCC[C@H](NC(=O)[C@@H](NC(=O)[C@H](Cc1ccc(O)cc1)NC(C)=O)C(C)C)C(=O)NCC(=O)N[C@@H](Cc1cnc[nH]1)C(=O)N[C@H](Cc1ccccc1)C(=O)N[C@@H](CCCN=C(N)N)C(=O)N[C@@H](Cc1c[nH]c2ccccc12)C(=O)N[C@@H](CC(O)=O)C(=O)N[C@@H](CCCN=C(N)N)C(=O)N[C@@H](Cc1ccccc1)C(=O)NCC(N)=O
: