Target
Muscarinic acetylcholine receptor M1
Ligand
BDBM50005847
Substrate
Meas. Tech.
ChEBML_138135
Ki
15000±n/a nM
Citation
 Nordvall, GSundquist, SGlas, GGogoll, ANilvebrant, LHacksell, U Analogues of the muscarinic agent 2'-methylspiro[1-azabicyclo[2.2.2]octane-3,4'-[1,3]dioxolane]: synthesis and pharmacology. J Med Chem 35:1541-50 (1992)  
Target
Name:
Muscarinic acetylcholine receptor M1
Synonyms:
ACM1_HUMAN Cholinergic receptor, muscarinic 1 | Cholinergic, muscarinic M1
Type:
Protein
Mol. Mass.:
51442.54
Organism:
Homo sapiens (Human)
Description:
P11229
Residue:
460
  
Inhibitor
Name:
BDBM50005847
Synonyms:
(2R,5'S)-5'-methyldihydro-3'H-spiro[4-azabicyclo[2.2.2]octane-2,2'-furan] | CHEMBL287834
Type:
Small organic molecule
Emp. Form.:
C11H19NO
Mol. Mass.:
181.2747
SMILES:
C[C@H]1CCC2(CN3CCC2CC3)O1
: