Target
Muscarinic acetylcholine receptor
Ligand
BDBM50005848
Substrate
Meas. Tech.
ChEMBL_138317 (CHEMBL747601)
Ki
25000±n/a nM
Citation
 Nordvall, GSundquist, SGlas, GGogoll, ANilvebrant, LHacksell, U Analogues of the muscarinic agent 2'-methylspiro[1-azabicyclo[2.2.2]octane-3,4'-[1,3]dioxolane]: synthesis and pharmacology. J Med Chem 35:1541-50 (1992)  
Target
Name:
Muscarinic acetylcholine receptor
Synonyms:
GPM3 | Muscarinic acetylcholine receptor M3
Type:
Mol. Mass.:
66272.13
Organism:
Cavia porcellus
Description:
Residue:
587
  
Inhibitor
Name:
BDBM50005848
Synonyms:
(2'R)-2'-methylspiro[4-azabicyclo[2.2.2]octane-2,4'-[1,3]dioxolane] (2R,2'R)-2'-methylspiro[4-azabicyclo[2.2.2]octane-2,4'-[1,3]dioxolane] CHEMBL291280
Type:
Small organic molecule
Emp. Form.:
C10H17NO2
Mol. Mass.:
183.2475
SMILES:
C[C@@H]1OCC2(CN3CCC2CC3)O1
: