Target
L-lactate dehydrogenase B chain
Ligand
BDBM50250644
Substrate
Meas. Tech.
ChEBML_1682055
IC50
1510±n/a nM
Citation
 Rai, GBrimacombe, KRMott, BTUrban, DJHu, XYang, SMLee, TDCheff, DMKouznetsova, JBenavides, GAPohida, KKuenstner, EJLuci, DKLukacs, CMDavies, DRDranow, DMZhu, HSulikowski, GMoore, WJStott, GMFlint, AJHall, MDDarley-Usmar, VMNeckers, LMDang, CVWaterson, AGSimeonov, AJadhav, AMaloney, DJ Discovery and Optimization of Potent, Cell-Active Pyrazole-Based Inhibitors of Lactate Dehydrogenase (LDH). J Med Chem 60:9184-9204 (2017)  
Target
Name:
L-lactate dehydrogenase B chain
Synonyms:
L-lactate dehydrogenase B LDH heart subunit LDH-H LDHB_HUMAN Renal carcinoma antigen NY-REN-46
Type:
Oxidoreductase; homotetramer
Mol. Mass.:
36635.55
Organism:
Homo sapiens (Human)
Description:
Residue:
334
  
Inhibitor
Name:
BDBM50250644
Synonyms:
CHEMBL4084774 US11247971, Cmpd ID 69
Type:
Small organic molecule
Emp. Form.:
C20H15BrN4O5S2
Mol. Mass.:
535.391
SMILES:
NS(=O)(=O)c1ccc(Cc2c(O)n(nc2-c2cccc(Br)c2)-c2nc(cs2)C(O)=O)cc1
: