Target
CREB-binding protein
Ligand
BDBM50250880
Substrate
Meas. Tech.
ChEBML_1682592
IC50
3.4±n/a nM
Citation
 Bronner, SMMurray, JRomero, FALai, KWTsui, VCyr, PBeresini, MHde Leon Boenig, GChen, ZChoo, EFClark, KRCrawford, TDJayaram, HKaufman, SLi, RLi, YLiao, JLiang, XLiu, WLy, JMaher, JWai, JWang, FZheng, AZhu, XMagnuson, S A Unique Approach to Design Potent and Selective Cyclic Adenosine Monophosphate Response Element Binding Protein, Binding Protein (CBP) Inhibitors. J Med Chem 60:10151-10171 (2017)  
Target
Name:
CREB-binding protein
Synonyms:
CBP CREB-binding protein (CBP) CREBBP
Type:
Transcription Coactivator
Mol. Mass.:
265411.66
Organism:
Homo sapiens (Human)
Description:
Q92793
Residue:
2442
  
Inhibitor
Name:
BDBM50250880
Synonyms:
CHEMBL4068116
Type:
Small organic molecule
Emp. Form.:
C24H25F2N5O
Mol. Mass.:
437.485
SMILES:
C[C@@H]1CC(=O)Nc2cccc(N3CCCc4cc(-c5cnn(C)c5)c(cc34)C(F)F)c2N1
: