Target
Bromodomain-containing protein 3
Ligand
BDBM50250892
Substrate
Meas. Tech.
ChEBML_1682605
Kd
8700±n/a nM
Citation
 Bronner, SMMurray, JRomero, FALai, KWTsui, VCyr, PBeresini, MHde Leon Boenig, GChen, ZChoo, EFClark, KRCrawford, TDJayaram, HKaufman, SLi, RLi, YLiao, JLiang, XLiu, WLy, JMaher, JWai, JWang, FZheng, AZhu, XMagnuson, S A Unique Approach to Design Potent and Selective Cyclic Adenosine Monophosphate Response Element Binding Protein, Binding Protein (CBP) Inhibitors. J Med Chem 60:10151-10171 (2017)  
Target
Name:
Bromodomain-containing protein 3
Synonyms:
BRD3 Bromodomain and extra-terminal motif (BET) Bromodomain-containing protein 3 (BRD3) RING3-like protein | RING3L
Type:
Protein
Mol. Mass.:
79571.81
Organism:
Homo sapiens (Human)
Description:
Q15059
Residue:
726
  
Inhibitor
Name:
BDBM50250892
Synonyms:
CHEMBL4061254 US11168070, Example 63
Type:
Small organic molecule
Emp. Form.:
C26H28F2N6O
Mol. Mass.:
478.5369
SMILES:
CNC(=O)c1c[nH]c2c(nc(cc12)N1CCCc2cc(-c3cnn(C)c3)c(cc12)C(F)F)C(C)C
: