Target
Bromodomain-containing protein 9
Ligand
BDBM50178219
Substrate
Meas. Tech.
ChEBML_1682602
IC50
730±n/a nM
Citation
 Bronner, SMMurray, JRomero, FALai, KWTsui, VCyr, PBeresini, MHde Leon Boenig, GChen, ZChoo, EFClark, KRCrawford, TDJayaram, HKaufman, SLi, RLi, YLiao, JLiang, XLiu, WLy, JMaher, JWai, JWang, FZheng, AZhu, XMagnuson, S A Unique Approach to Design Potent and Selective Cyclic Adenosine Monophosphate Response Element Binding Protein, Binding Protein (CBP) Inhibitors. J Med Chem 60:10151-10171 (2017)  
Target
Name:
Bromodomain-containing protein 9
Synonyms:
BRD9 Bromodomain-containing protein 9 | Rhabdomyosarcoma antigen MU-RMS-40.8
Type:
PROTEIN
Mol. Mass.:
66994.30
Organism:
Homo sapiens (Human)
Description:
ChEMBL_108000
Residue:
597
  
Inhibitor
Name:
BDBM50178219
Synonyms:
CHEMBL3814752
Type:
Small organic molecule
Emp. Form.:
C22H22N6O
Mol. Mass.:
386.4497
SMILES:
C[C@@H]1CC(=O)Nc2cccc(-c3ccc4n(C)nc(-c5cnn(C)c5)c4c3)c2N1
: