Target
Renin
Ligand
BDBM50006127
Substrate
Meas. Tech.
ChEMBL_195925 (CHEMBL803394)
pH
7.4±n/a
IC50
>1000±n/a nM
Comments
extracted
Citation
 Martin, SFAustin, REOalmann, CJBaker, WRCondon, SLdeLara, ERosenberg, SHSpina, KPStein, HHCohen, J 1,2,3-trisubstituted cyclopropanes as conformationally restricted peptide isosteres: application to the design and synthesis of novel renin inhibitors. J Med Chem 35:1710-21 (1992)  
Target
Name:
Renin
Synonyms:
Angiotensinogenase RENI_HUMAN
Type:
Enzyme
Mol. Mass.:
45058.99
Organism:
Homo sapiens (Human)
Description:
Residue:
406
  
Inhibitor
Name:
BDBM50006127
Synonyms:
2-Isobutyl-3-(morpholine-4-carbonyl)-cyclopropanecarboxylic acid [1-(1-cyclohexylmethyl-2,3-dihydroxy-5-methyl-hexylcarbamoyl)-2-thiazol-4-yl-ethyl]-amide | CHEMBL49287
Type:
Small organic molecule
Emp. Form.:
C33H54N4O6S
Mol. Mass.:
634.87
SMILES:
CC(C)C[C@H](O)[C@H](O)[C@H](CC1CCCCC1)NC(=O)[C@H](Cc1cscn1)NC(=O)[C@@H]1[C@H](CC(C)C)[C@H]1C(=O)N1CCOCC1
: