Target
Renin
Ligand
BDBM50006172
Substrate
Meas. Tech.
ChEBML_195793
pH
7.4±n/a
IC50
24±n/a nM
Comments
extracted
Citation
 Baker, WRFung, AKKleinert, HDStein, HHPlattner, JJArmiger, YLCondon, SLCohen, JEgan, DABarlow, JL Nonpeptide renin inhibitors employing a novel 3-aza(or oxa)-2,4-dialkyl glutaric acid moiety as a P2/P3 amide bond replacement. J Med Chem 35:1722-34 (1992)  
Target
Name:
Renin
Synonyms:
Angiotensinogenase RENI_HUMAN
Type:
Enzyme
Mol. Mass.:
45058.99
Organism:
Homo sapiens (Human)
Description:
Residue:
406
  
Inhibitor
Name:
BDBM50006172
Synonyms:
2-(1-Benzyl-2-oxo-2-piperidin-1-yl-ethoxy)-hexanoic acid (1-cyclohexylmethyl-2,3-dihydroxy-5-methyl-hexyl)-amide | CHEMBL48112
Type:
Small organic molecule
Emp. Form.:
C34H56N2O5
Mol. Mass.:
572.8188
SMILES:
CCCC[C@H](O[C@@H](Cc1ccccc1)C(=O)N1CCCCC1)C(=O)N[C@@H](CC1CCCCC1)[C@@H](O)[C@@H](O)CC(C)C
: